Reaction Details
TargetLeukotriene C4 synthase
LigandBDBM223268
Substrate/Competitorn/a
Meas. Tech.In Vitro hLTC4 Synthase Enzyme Assay
IC50 74.0±n/a nM
Citation Ronn, RLindh, CJRingberg, EAndersson, HBNilsson, PSchaal, WRMunck af Rosenschöld, MNikitidis, ANikitidis, GJohannesson, PTyrchan, C Compounds and uses US Patent US9657001 Publication Date 5/23/2017
 
Leukotriene C4 synthase
Name:Leukotriene C4 synthase
Type:PROTEIN
Mol. Mass.:16575.59
Organism:Homo sapiens (Human)
Description:ChEMBL_961179
Residue:150
BDBM223268
NameBDBM223268
Synonyms:2-(5-((4-Chlorophenyl)(cyclopropylmethyl)amino)-3-methoxypicolinoyl)-N-((2-fluorophenyl)sulfonyl)-cyclopropanecarboxamide US9657001, 43
TypeSmall Organic Molecule
Emp. Form.C27H25ClFN3O5S
Mol. Mass.558.021
SMILESCOc1cc(cnc1C(=O)C1CC1C(=O)NS(=O)(=O)c1ccccc1F)N(CC1CC1)c1ccc(Cl)cc1