Reaction Details
TargetLeukotriene C4 synthase
LigandBDBM223269
Substrate/Competitorn/a
Meas. Tech.In Vitro hLTC4 Synthase Enzyme Assay
IC50 56.0±n/a nM
Citation Ronn, RLindh, CJRingberg, EAndersson, HBNilsson, PSchaal, WRMunck af Rosenschöld, MNikitidis, ANikitidis, GJohannesson, PTyrchan, C Compounds and uses US Patent US9657001 Publication Date 5/23/2017
 
Leukotriene C4 synthase
Name:Leukotriene C4 synthase
Type:PROTEIN
Mol. Mass.:16575.59
Organism:Homo sapiens (Human)
Description:ChEMBL_961179
Residue:150
BDBM223269
NameBDBM223269
Synonyms:2-(6-(Cyclopropylmethyl)(4-methylnaphthalen-1-yl)amino)-4-methoxynicotinoyl)cyclopropanecarboxylic acid US9657001, 44
TypeSmall Organic Molecule
Emp. Form.C26H26N2O4
Mol. Mass.430.4956
SMILESCOc1cc(ncc1C(=O)C1CC1C(O)=O)N(CC1CC1)c1ccc(C)c2ccccc12