Reaction Details
TargetLeukotriene C4 synthase
LigandBDBM223275
Substrate/Competitorn/a
Meas. Tech.In Vitro hLTC4 Synthase Enzyme Assay
IC50 75.0±n/a nM
Citation Ronn, RLindh, CJRingberg, EAndersson, HBNilsson, PSchaal, WRMunck af Rosenschöld, MNikitidis, ANikitidis, GJohannesson, PTyrchan, C Compounds and uses US Patent US9657001 Publication Date 5/23/2017
 
Leukotriene C4 synthase
Name:Leukotriene C4 synthase
Type:PROTEIN
Mol. Mass.:16575.59
Organism:Homo sapiens (Human)
Description:ChEMBL_961179
Residue:150
BDBM223275
NameBDBM223275
Synonyms:2-(4-((Cyclopropylmethyl)(3,4-dimethylphenyl)amino)-2-methoxybenzoyl)cyclopropanecarboxylic acid US9657001, 50
TypeSmall Organic Molecule
Emp. Form.C24H27NO4
Mol. Mass.393.4755
SMILESCOc1cc(ccc1C(=O)C1CC1C(O)=O)N(CC1CC1)c1ccc(C)c(C)c1