Reaction Details
TargetLeukotriene C4 synthase
LigandBDBM223282
Substrate/Competitorn/a
Meas. Tech.In Vitro hLTC4 Synthase Enzyme Assay
IC50 50.0±n/a nM
Citation Ronn, RLindh, CJRingberg, EAndersson, HBNilsson, PSchaal, WRMunck af Rosenschöld, MNikitidis, ANikitidis, GJohannesson, PTyrchan, C Compounds and uses US Patent US9657001 Publication Date 5/23/2017
 
Leukotriene C4 synthase
Name:Leukotriene C4 synthase
Type:PROTEIN
Mol. Mass.:16575.59
Organism:Homo sapiens (Human)
Description:ChEMBL_961179
Residue:150
BDBM223282
NameBDBM223282
Synonyms:2-(5-((Cyclopropylmethyl)(naphthalen-1-yl)amino)-4-methoxypyrimidine-2-carbonyl)cyclopropanecarboxylic acid US9657001, 57
TypeSmall Organic Molecule
Emp. Form.C24H23N3O4
Mol. Mass.417.4571
SMILESCOc1nc(ncc1N(CC1CC1)c1cccc2ccccc12)C(=O)C1CC1C(O)=O