Reaction Details
TargetSteroid 17-alpha-hydroxylase/17,20 lyase
LigandBDBM8892
Substrate/CompetitorBDBM8903
Meas. Tech.CYP17 Assay
IC50 1085±n/a nM
Citation Voets, MAntes, IScherer, CMuller-Vieira, UBiemel, KMarchais-Oberwinkler, SHartmann, RW Synthesis and evaluation of heteroaryl-substituted dihydronaphthalenes and indenes: potent and selective inhibitors of aldosterone synthase (CYP11B2) for the treatment of congestive heart failure and myocardial fibrosis. Pharmacol Rev49:2222-31 (2006) 
 
Steroid 17-alpha-hydroxylase/17,20 lyase
Name:Steroid 17-alpha-hydroxylase/17,20 lyase
Type:Enzyme
Mol. Mass.:57382.42
Organism:Homo sapiens (Human)
Description:E.coli expressing human CYP17
Residue:508
BDBM8892
BDBM8903
NameBDBM8892
Synonyms:3-(1-Methyl-3,4-dihydronaphthalen-2-yl)-pyridine Dihydronaphthalene 6 | US9271963, 38
TypeSmall organic molecule
Emp. Form.C16H15N
Mol. Mass.221.297
SMILESCC1=C(CCc2ccccc12)c1cccnc1