Reaction Details
TargetCytochrome P450 11B2, mitochondrial
LigandBDBM8905
Substrate/CompetitorBDBM8582
Meas. Tech.CYP11B Assay
IC50 6±n/a nM
Citation Voets, MAntes, IScherer, CMuller-Vieira, UBiemel, KBarassin, CMarchais-Oberwinkler, SHartmann, RW Heteroaryl-substituted naphthalenes and structurally modified derivatives: selective inhibitors of CYP11B2 for the treatment of congestive heart failure and myocardial fibrosis. J Med Chem48:6632-42 (2005) 
 
Cytochrome P450 11B2, mitochondrial
Name:Cytochrome P450 11B2, mitochondrial
Type:Protein
Mol. Mass.:57582.15
Organism:Homo sapiens (Human)
Description:P19099
Residue:503
BDBM8905
BDBM8582
NameBDBM8905
Synonyms:3-(6-Methoxy-2-naphthyl)pyridine CHEMBL362968 US9271963, 2
TypeSmall organic molecule
Emp. Form.C16H13NO
Mol. Mass.235.2805
SMILESCOc1ccc2cc(ccc2c1)-c1cccnc1