Reaction Details
TargetCytochrome P450 11B2, mitochondrial
LigandBDBM8909
Substrate/CompetitorBDBM8582
Meas. Tech.CYP11B Assay
IC50 3±n/a nM
Citation Voets, MAntes, IScherer, CMuller-Vieira, UBiemel, KBarassin, CMarchais-Oberwinkler, SHartmann, RW Heteroaryl-substituted naphthalenes and structurally modified derivatives: selective inhibitors of CYP11B2 for the treatment of congestive heart failure and myocardial fibrosis. J Med Chem48:6632-42 (2005) 
 
Cytochrome P450 11B2, mitochondrial
Name:Cytochrome P450 11B2, mitochondrial
Type:Protein
Mol. Mass.:57582.15
Organism:Homo sapiens (Human)
Description:P19099
Residue:503
BDBM8909
BDBM8582
NameBDBM8909
Synonyms:6-(pyridin-3-yl)naphthalene-2-carbonitrile CHEMBL196796 US9271963, 8
TypeSmall organic molecule
Emp. Form.C16H10N2
Mol. Mass.230.264
SMILESN#Cc1ccc2cc(ccc2c1)-c1cccnc1