Reaction Details
TargetNeutrophil elastase
LigandBDBM310076
Substrate/Competitorn/a
Meas. Tech.Neutrophil Elastase Assay
IC50<1.000±n/a nM
Citation Gnamm, CAnderskewitz, RHoesch, HMorschhaeuser, GOost, TPeters, SRies, UJ Substituted bicyclic dihydropyrimidinones and their use as inhibitors of neutrophil elastase activity US Patent US9657015 Publication Date 5/23/2017
 
Neutrophil elastase
Name:Neutrophil elastase
Type:Enzyme
Mol. Mass.:28532.38
Organism:Homo sapiens (Human)
Description:P08246
Residue:267
BDBM310076
NameBDBM310076
Synonyms:US9657015, Example 36 US9657015, Example 36.2 | US9657015, Example 36.3
TypeSmall organic molecule
Emp. Form.C27H23F3N6O2
Mol. Mass.520.5057
SMILESCN1CCC2=C(C(N(C)C(=O)N2c2cccc(c2)C(F)(F)F)c2ccc(cc2-c2cnn(C)c2)C#N)C1=O