Reaction Details
TargetNeutrophil elastase
LigandBDBM310081
Substrate/Competitorn/a
Meas. Tech.Neutrophil Elastase Assay
IC50<1.000±n/a nM
Citation Gnamm, CAnderskewitz, RHoesch, HMorschhaeuser, GOost, TPeters, SRies, UJ Substituted bicyclic dihydropyrimidinones and their use as inhibitors of neutrophil elastase activity US Patent US9657015 Publication Date 5/23/2017
 
Neutrophil elastase
Name:Neutrophil elastase
Type:Enzyme
Mol. Mass.:28532.38
Organism:Homo sapiens (Human)
Description:P08246
Residue:267
BDBM310081
NameBDBM310081
Synonyms:US9657015, Example 38
TypeSmall organic molecule
Emp. Form.C24H21F3N4O3
Mol. Mass.470.4437
SMILESCN1CCC2=C(C(N(C)C(=O)N2c2cccc(c2)C(F)(F)F)c2ccc(cc2CO)C#N)C1=O