Reaction Details
TargetProteinase-activated receptor 4
LigandBDBM176039
Substrate/Competitorn/a
Meas. Tech.FLIPR Assay
Temperature298.15±n/a K
EC50 0.26±n/a nM
Commentsextracted
Citation Banville, JRémillard, RRuediger, EHDeon, DHGagnon, MDubé, LGuy, JPriestley, ESPosy, SLMaxwell, BDWong, PCLawrence, RMMiller, MM Imidazothiadiazole and imidazopyrazine derivatives as protease activated receptor 4 (PAR4) inhibitors for treating platelet aggregation US Patent US9688695 Publication Date 6/27/2017
 
Proteinase-activated receptor 4
Name:Proteinase-activated receptor 4
Type:Protein
Mol. Mass.:41145.16
Organism:Homo sapiens (Human)
Description:Q96RI0
Residue:385
BDBM176039
NameBDBM176039
Synonyms:US10047103, 72 | US9688695, 72
TypeSmall organic molecule
Emp. Form.C25H19N5O5S2
Mol. Mass.533.579
SMILESCOc1nn2cc(nc2s1)-c1cc2c(OCc3csc(n3)-c3ccc(cc3)C(N)=O)cc(OC)cc2o1