Reaction Details
TargetMyosin light chain kinase, smooth muscle
LigandBDBM307640
Substrate/Competitorn/a
Meas. Tech.MYLK/MLCK Assay
Ki 600±n/a nM
Citation Brown, SD ASK1 inhibitor compounds and uses thereof US Patent US10150755 Publication Date 12/11/2018
 
Myosin light chain kinase, smooth muscle
Name:Myosin light chain kinase, smooth muscle
Type:Protein
Mol. Mass.:210702.56
Organism:Homo sapiens (Human)
Description:Q15746
Residue:1914
BDBM307640
NameBDBM307640
Synonyms:N-(2-(6-(4-cyclopropyl-4H-1,2,4-triazol-3-yl)pyridin-2-yl)-1-oxoisoindolin-5-yl)acetamide | US10150755, Compound 32
TypeSmall organic molecule
Emp. Form.C20H18N6O2
Mol. Mass.374.3959
SMILESCC(=O)Nc1ccc2C(=O)N(Cc2c1)c1cccc(n1)-c1nncn1C1CC1