Reaction Details
TargetMitogen-activated protein kinase kinase kinase 5
LigandBDBM307646
Substrate/Competitorn/a
Meas. Tech.ASK1 Kinase Assay
Ki<200±n/a nM
Citation Brown, SD ASK1 inhibitor compounds and uses thereof US Patent US10150755 Publication Date 12/11/2018
 
Mitogen-activated protein kinase kinase kinase 5
Name:Mitogen-activated protein kinase kinase kinase 5
Type:Protein
Mol. Mass.:154514.93
Organism:Homo sapiens (Human)
Description:Q99683
Residue:1374
BDBM307646
NameBDBM307646
Synonyms:US10150755, Compound 38
TypeSmall organic molecule
Emp. Form.C25H19N7O
Mol. Mass.433.4647
SMILESO=C1N(Cc2ccc(cc12)-n1cnc2ccccc12)c1cccc(n1)-c1nncn1C1CC1