Reaction Details
TargetMyosin light chain kinase, smooth muscle
LigandBDBM307671
Substrate/Competitorn/a
Meas. Tech.MYLK/MLCK Assay
Ki 5500±n/a nM
Citation Brown, SD ASK1 inhibitor compounds and uses thereof US Patent US10150755 Publication Date 12/11/2018
 
Myosin light chain kinase, smooth muscle
Name:Myosin light chain kinase, smooth muscle
Type:Protein
Mol. Mass.:210702.56
Organism:Homo sapiens (Human)
Description:Q15746
Residue:1914
BDBM307671
NameBDBM307671
Synonyms:2-(6-(4-cyclopropyl-4H-1,2,4-triazol-3-yl)pyridin-2-yl)-5-fluoro-6-(pyridin-3-yl)isoindolin-1-one | US10150755, Compound 63
TypeSmall organic molecule
Emp. Form.C23H17FN6O
Mol. Mass.412.4191
SMILESFc1cc2CN(C(=O)c2cc1-c1cccnc1)c1cccc(n1)-c1nncn1C1CC1