Reaction Details
TargetMyosin light chain kinase, smooth muscle
LigandBDBM307677
Substrate/Competitorn/a
Meas. Tech.MYLK/MLCK Assay
Ki 600±n/a nM
Citation Brown, SD ASK1 inhibitor compounds and uses thereof US Patent US10150755 Publication Date 12/11/2018
 
Myosin light chain kinase, smooth muscle
Name:Myosin light chain kinase, smooth muscle
Type:Protein
Mol. Mass.:210702.56
Organism:Homo sapiens (Human)
Description:Q15746
Residue:1914
BDBM307677
NameBDBM307677
Synonyms:US10150755, Compound 69
TypeSmall organic molecule
Emp. Form.C28H26N6O2
Mol. Mass.478.545
SMILESO=C1N(Cc2cc(OC3CCCC3)c(cc12)-c1cccnc1)c1cccc(n1)-c1nncn1C1CC1