Reaction Details
TargetMyosin light chain kinase, smooth muscle
LigandBDBM307686
Substrate/Competitorn/a
Meas. Tech.MYLK/MLCK Assay
Ki<200±n/a nM
Citation Brown, SD ASK1 inhibitor compounds and uses thereof US Patent US10150755 Publication Date 12/11/2018
 
Myosin light chain kinase, smooth muscle
Name:Myosin light chain kinase, smooth muscle
Type:Protein
Mol. Mass.:210702.56
Organism:Homo sapiens (Human)
Description:Q15746
Residue:1914
BDBM307686
NameBDBM307686
Synonyms:2-(6-(5-methyl-6,7-dihydro-5H-pyrrolo[2,1-c][1,2,4]triazol-3-yl)pyridin-2-yl)isoindolin-1-one | US10150755, Compound 78
TypeSmall organic molecule
Emp. Form.C19H17N5O
Mol. Mass.331.3712
SMILESCC1CCc2nnc(-c3cccc(n3)N3Cc4ccccc4C3=O)n12