Reaction Details
TargetCarboxylic ester hydrolase
LigandBDBM8968
Substrate/CompetitorBDBM8978
Meas. Tech.Measurement of FBSAChE/EqBuChE Inhibitory Activity
Ki 3.3±n/a nM
Citation Campiani, GFattorusso, CButini, SGaeta, AAgnusdei, MGemma, SPersico, MCatalanotti, BSavini, LNacci, VNovellino, EHolloway, HWGreig, NHBelinskaya, TFedorko, JMSaxena, A Development of molecular probes for the identification of extra interaction sites in the mid-gorge and peripheral sites of butyrylcholinesterase (BuChE). Rational design of novel, selective, and highly potent BuChE inhibitors. J Med Chem48:1919-29 (2005) 
 
Carboxylic ester hydrolase
Name:Carboxylic ester hydrolase
Type:Protein
Mol. Mass.:68842.83
Organism:Equus caballus (Horse)
Description:Q9N1N9
Residue:602
BDBM8968
BDBM8978
NameBDBM8968
Synonyms:2-{bis[3-(1,2,3,4-tetrahydroacridin-9-ylamino)propyl]amino}ethan-1-ol Tacrine Dimer 4d
TypeSmall organic molecule
Emp. Form.C34H43N5O
Mol. Mass.537.7381
SMILESOCCN(CCCNc1c2CCCCc2nc2ccccc12)CCCNc1c2CCCCc2nc2ccccc12