Reaction Details
TargetCarboxylic ester hydrolase
LigandBDBM9006
Substrate/CompetitorBDBM8978
Meas. Tech.Cholinesterase Inhibition Assay
IC50 12±n/a nM
Citation Rodriguez-Franco, MIFernandez-Bachiller, MIPerez, CHernandez-Ledesma, BBartolome, B Novel tacrine-melatonin hybrids as dual-acting drugs for Alzheimer disease, with improved acetylcholinesterase inhibitory and antioxidant properties. J Med Chem49:459-62 (2006) 
 
Carboxylic ester hydrolase
Name:Carboxylic ester hydrolase
Type:Protein
Mol. Mass.:68842.83
Organism:Equus caballus (Horse)
Description:Q9N1N9
Residue:602
BDBM9006
BDBM8978
NameBDBM9006
Synonyms:6-(1,2,3,4-Tetrahydro-acridin-9-ylamino)-hexanoic acid [2-(1H-indol-3-yl)-ethyl]-amide Tacrine-Melatonin Hybrid 3a
TypeSmall organic molecule
Emp. Form.C29H34N4O
Mol. Mass.454.6065
SMILESO=C(CCCCCNc1c2CCCCc2nc2ccccc12)NCCc1c[nH]c2ccccc12