Reaction Details
TargetCarboxylic ester hydrolase
LigandBDBM9011
Substrate/CompetitorBDBM8978
Meas. Tech.Cholinesterase Inhibition Assay
IC50 8.2±n/a nM
Citation Rodriguez-Franco, MIFernandez-Bachiller, MIPerez, CHernandez-Ledesma, BBartolome, B Novel tacrine-melatonin hybrids as dual-acting drugs for Alzheimer disease, with improved acetylcholinesterase inhibitory and antioxidant properties. J Med Chem49:459-62 (2006) 
 
Carboxylic ester hydrolase
Name:Carboxylic ester hydrolase
Type:Protein
Mol. Mass.:68842.83
Organism:Equus caballus (Horse)
Description:Q9N1N9
Residue:602
BDBM9011
BDBM8978
NameBDBM9011
Synonyms:6-(6,8-Dichloro-1,2,3,4-tetrahydro-acridin-9-ylamino)-hexanoic acid [2-(1H-indol-3-yl)-ethyl]-amide Tacrine-Melatonin Hybrid 6a
TypeSmall organic molecule
Emp. Form.C29H32Cl2N4O
Mol. Mass.523.497
SMILESClc1cc(Cl)c2c(NCCCCCC(=O)NCCc3c[nH]c4ccccc34)c3CCCCc3nc2c1