Reaction Details
TargetCarboxylic ester hydrolase
LigandBDBM9016
Substrate/CompetitorBDBM8978
Meas. Tech.Cholinesterase Inhibition Assay
IC50 22±n/a nM
Citation Rodriguez-Franco, MIFernandez-Bachiller, MIPerez, CHernandez-Ledesma, BBartolome, B Novel tacrine-melatonin hybrids as dual-acting drugs for Alzheimer disease, with improved acetylcholinesterase inhibitory and antioxidant properties. J Med Chem49:459-62 (2006) 
 
Carboxylic ester hydrolase
Name:Carboxylic ester hydrolase
Type:Protein
Mol. Mass.:68842.83
Organism:Equus caballus (Horse)
Description:Q9N1N9
Residue:602
BDBM9016
BDBM8978
NameBDBM9016
Synonyms:6-(8-Chloro-1,2,3,4-tetrahydro-acridin-9-ylamino)-hexanoic acid [2-(5-methoxy-1H-indol-3-yl)-ethyl]-amide Tacrine-Melatonin Hybrid 9a
TypeSmall organic molecule
Emp. Form.C30H35ClN4O2
Mol. Mass.519.078
SMILESCOc1ccc2[nH]cc(CCNC(=O)CCCCCNc3c4CCCCc4nc4cccc(Cl)c34)c2c1