Reaction Details
TargetAcetylcholinesterase
LigandBDBM9010
Substrate/CompetitorBDBM8959
Meas. Tech.Cholinesterase Inhibition Assay
IC50 0.87±n/a nM
Citation Rodriguez-Franco, MIFernandez-Bachiller, MIPerez, CHernandez-Ledesma, BBartolome, B Novel tacrine-melatonin hybrids as dual-acting drugs for Alzheimer disease, with improved acetylcholinesterase inhibitory and antioxidant properties. J Med Chem49:459-62 (2006) 
 
Acetylcholinesterase
Name:Acetylcholinesterase
Type:Enzyme
Mol. Mass.:67792.70
Organism:Homo sapiens (Human)
Description:P22303
Residue:614
BDBM9010
BDBM8959
NameBDBM9010
Synonyms:6-(8-Chloro-1,2,3,4-tetrahydro-acridin-9-ylamino)-hexanoic acid [2-(1H-indol-3-yl)-ethyl]-amide Tacrine-Melatonin Hybrid 5a
TypeSmall organic molecule
Emp. Form.C29H33ClN4O
Mol. Mass.489.052
SMILESClc1cccc2nc3CCCCc3c(NCCCCCC(=O)NCCc3c[nH]c4ccccc34)c12