Reaction Details
TargetAcetylcholinesterase
LigandBDBM9018
Substrate/CompetitorBDBM8959
Meas. Tech.Cholinesterase Inhibition Assay
IC50 0.45±n/a nM
Citation Rodriguez-Franco, MIFernandez-Bachiller, MIPerez, CHernandez-Ledesma, BBartolome, B Novel tacrine-melatonin hybrids as dual-acting drugs for Alzheimer disease, with improved acetylcholinesterase inhibitory and antioxidant properties. J Med Chem49:459-62 (2006) 
 
Acetylcholinesterase
Name:Acetylcholinesterase
Type:Enzyme
Mol. Mass.:67792.70
Organism:Homo sapiens (Human)
Description:P22303
Residue:614
BDBM9018
BDBM8959
NameBDBM9018
Synonyms:6-(1,2,3,4-Tetrahydro-acridin-9-ylamino)-hexanoic acid [2-(5-hydroxy-1H-indol-3-yl)-ethyl]-amide Tacrine-Melatonin Hybrid 11a
TypeSmall organic molecule
Emp. Form.C29H34N4O2
Mol. Mass.470.6059
SMILESOc1ccc2[nH]cc(CCNC(=O)CCCCCNc3c4CCCCc4nc4ccccc34)c2c1