Reaction Details
TargetAcetylcholinesterase
LigandBDBM9023
Substrate/CompetitorBDBM8959
Meas. Tech.In Vitro Enzyme Inhibition Assay
pH8±n/a
Temperature303.15±n/a K
IC50 0.06±n/a nM
Citation Munoz-Ruiz, PRubio, LGarcia-Palomero, EDorronsoro, Idel Monte-Millan, MValenzuela, RUsan, Pde Austria, CBartolini, MAndrisano, VBidon-Chanal, AOrozco, MLuque, FJMedina, MMartinez, A Design, synthesis, and biological evaluation of dual binding site acetylcholinesterase inhibitors: new disease-modifying agents for Alzheimer's disease. J Med Chem48:7223-33 (2005) 
 
Acetylcholinesterase
Name:Acetylcholinesterase
Type:Enzyme
Mol. Mass.:67659.62
Organism:Bos taurus (bovine)
Description:n/a
Residue:613
BDBM9023
BDBM8959
NameBDBM9023
Synonyms:CHEMBL225198 N-[7-(6-Chloro-1,2,3,4-tetrahydroacridin-9-ylamino)-heptyl]-3-(1H-indol-3-yl)propionamide | N-{7-[(6-chloro-1,2,3,4-tetrahydroacridin-9-yl)amino]heptyl}-3-(1H-indol-3-yl)propanamide
TypeSmall organic molecule
Emp. Form.C31H37ClN4O
Mol. Mass.517.105
SMILESClc1ccc2c(NCCCCCCCNC(=O)CCc3c[nH]c4ccccc34)c3CCCCc3nc2c1