Reaction Details
TargetAcetylcholinesterase
LigandBDBM9029
Substrate/CompetitorBDBM8959
Meas. Tech.In Vitro Enzyme Inhibition Assay
pH8±n/a
Temperature303.15±n/a K
IC50 0.7±n/a nM
Citation Munoz-Ruiz, PRubio, LGarcia-Palomero, EDorronsoro, Idel Monte-Millan, MValenzuela, RUsan, Pde Austria, CBartolini, MAndrisano, VBidon-Chanal, AOrozco, MLuque, FJMedina, MMartinez, A Design, synthesis, and biological evaluation of dual binding site acetylcholinesterase inhibitors: new disease-modifying agents for Alzheimer's disease. J Med Chem48:7223-33 (2005) 
 
Acetylcholinesterase
Name:Acetylcholinesterase
Type:Enzyme
Mol. Mass.:67659.62
Organism:Bos taurus (bovine)
Description:n/a
Residue:613
BDBM9029
BDBM8959
NameBDBM9029
Synonyms:Indole-Tacrine Heterodimer 12 N-{6-[(6-chloro-1,2,3,4-tetrahydroacridin-9-yl)amino]hexyl}-3-(5-cyano-1H-indol-3-yl)propanamide
TypeSmall organic molecule
Emp. Form.C31H34ClN5O
Mol. Mass.528.088
SMILESClc1ccc2c(NCCCCCCNC(=O)CCc3c[nH]c4ccc(cc34)C#N)c3CCCCc3nc2c1