Reaction Details
TargetHistone deacetylase 6
LigandBDBM310714
Substrate/Competitorn/a
Meas. Tech.HDAC inhibitory assay
IC50<500±n/a nM
Citation Shuttleworth, SJTomassi, CDCecil, ARMacCormick, SNodes, WJSilva, FA Histone deacetylase inhibitors and their use in therapy US Patent US10150763 Publication Date 12/11/2018
 
Histone deacetylase 6
Name:Histone deacetylase 6
Type:Chromatin regulator; hydrolase; repressor
Mol. Mass.:131381.51
Organism:Homo sapiens (Human)
Description:Q9UBN7
Residue:1215
BDBM310714
NameBDBM310714
Synonyms:N-Hydroxy-8-((1-methyl-1H-benzo[d]imidazol-2-yl)(pyridin-2-yl)amino)octanamide | US10150763, Example N
TypeSmall organic molecule
Emp. Form.C21H27N5O2
Mol. Mass.381.4714
SMILESCn1c(nc2ccccc12)N(CCCCCCCC(=O)NO)c1ccccn1