Reaction Details
TargetHistone deacetylase 6
LigandBDBM310716
Substrate/Competitorn/a
Meas. Tech.HDAC inhibitory assay
IC50<500±n/a nM
Citation Shuttleworth, SJTomassi, CDCecil, ARMacCormick, SNodes, WJSilva, FA Histone deacetylase inhibitors and their use in therapy US Patent US10150763 Publication Date 12/11/2018
 
Histone deacetylase 6
Name:Histone deacetylase 6
Type:Chromatin regulator; hydrolase; repressor
Mol. Mass.:131381.51
Organism:Homo sapiens (Human)
Description:Q9UBN7
Residue:1215
BDBM310716
NameBDBM310716
Synonyms:N-Hydroxy-8-(pyridin-2-yl(1,2,4-thiadiazol-5-yl)amino)octanamide | US10150763, Example P
TypeSmall organic molecule
Emp. Form.C15H21N5O2S
Mol. Mass.335.425
SMILESONC(=O)CCCCCCCN(c1ncns1)c1ccccn1