Reaction Details
TargetAcetylcholinesterase
LigandBDBM9078
Substrate/CompetitorBDBM8959
Meas. Tech.Cholinesterase Inhibition Assay
Ki 7500±n/a nM
IC50 7100±n/a nM
Citation Rampa, ABisi, ABelluti, FGobbi, SValenti, PAndrisano, VCavrini, VCavalli, ARecanatini, M Acetylcholinesterase inhibitors for potential use in Alzheimer's disease: molecular modeling, synthesis and kinetic evaluation of 11H-indeno-[1,2-b]-quinolin-10-ylamine derivatives. Bioorg Med Chem8:497-506 (2000) 
 
Acetylcholinesterase
Name:Acetylcholinesterase
Type:Enzyme
Mol. Mass.:67792.70
Organism:Homo sapiens (Human)
Description:P22303
Residue:614
BDBM9078
BDBM8959
NameBDBM9078
Synonyms:11H-indeno-[1,2-b]-quinolin-10-ylamine deriv. 2n N-benzyl-10H-indeno[1,2-b]quinolin-11-amine
TypeSmall organic molecule
Emp. Form.C23H18N2
Mol. Mass.322.4024
SMILESC(Nc1c2Cc3ccccc3-c2nc2ccccc12)c1ccccc1