Reaction Details
TargetP2X purinoceptor 7
LigandBDBM254247
Substrate/Competitorn/a
Meas. Tech.Radioligand Binding assay
Ki 1.60±n/a nM
Citation Alcazar Vaca, MJAndres Gil, JIChrovian, CCCoate, HRDe Angelis, MDvorak, CAGelin, CFLetavic, MASavall, BMSoyode-Johnson, AStenne, BMSwanson, DM P2X7 modulators US Patent US10150765 Publication Date 12/11/2018
 
P2X purinoceptor 7
Name:P2X purinoceptor 7
Type:Protein
Mol. Mass.:68403.50
Organism:Rattus norvegicus (Rat)
Description:Q64663
Residue:595
BDBM254247
NameBDBM254247
Synonyms:US10112937, Example 133 US10703749, Example 133 | US9464084, 133
TypeSmall organic molecule
Emp. Form.C17H14ClF3N6O
Mol. Mass.410.781
SMILESC[C@H]1N(CCc2c1nnn2-c1cc[nH]n1)C(=O)c1cccc(c1Cl)C(F)(F)F