Reaction Details
TargetP2X purinoceptor 7
LigandBDBM254371
Substrate/Competitorn/a
Meas. Tech.Radioligand Binding assay
Ki 2.30±n/a nM
Citation Alcazar Vaca, MJAndres Gil, JIChrovian, CCCoate, HRDe Angelis, MDvorak, CAGelin, CFLetavic, MASavall, BMSoyode-Johnson, AStenne, BMSwanson, DM P2X7 modulators US Patent US10150765 Publication Date 12/11/2018
 
P2X purinoceptor 7
Name:P2X purinoceptor 7
Type:Protein
Mol. Mass.:68602.85
Organism:Homo sapiens (Human)
Description:Q99572
Residue:595
BDBM254371
NameBDBM254371
Synonyms:US10112937, Example 278 US10703749, Example 278 | US9464084, 278
TypeSmall organic molecule
Emp. Form.C19H17F3N6O
Mol. Mass.402.3731
SMILESCC1N(CCc2c1nnn2-c1cnccn1)C(=O)c1cccc(c1C)C(F)(F)F