Reaction Details
TargetHistone-lysine N-methyltransferase EZH2 [Y641F]
LigandBDBM172161
Substrate/Competitorn/a
Meas. Tech.PRC2 Enzyme Assays
IC50 2.74±n/a nM
Citation Kuntz, KWChesworth, RDuncan, KWKeilhack, HWarholic, NKlaus, CKnutson, SKWigle, TJSeki, MShirotori, SKawano, S Aryl- or heteroaryl-substituted benzene compounds US Patent US10155002 Publication Date 12/18/2018
 
Histone-lysine N-methyltransferase EZH2 [Y641F]
Name:Histone-lysine N-methyltransferase EZH2 [Y641F]
Type:n/a
Mol. Mass.:85351.84
Organism:Homo sapiens (Human)
Description:Q15910[Y641F]
Residue:746
BDBM172161
NameBDBM172161
Synonyms:US10155002, Compound 169 US9090562, 169
TypeSmall organic molecule
Emp. Form.C30H42N6O2
Mol. Mass.518.6935
SMILESCCN([C@H]1CC[C@@H](CC1)N(C)C)c1cc(cc(C(=O)NCc2c(C)cc(C)[nH]c2=O)c1C)-c1nccn1C