Reaction Details
TargetEstrogen receptor
LigandBDBM26187
Substrate/Competitorn/a
Meas. Tech.Competitive Binding Assay
IC50>250000±n/a nM
Citation Gallucci, RRMahood, JAOdle, RRDimond, S Polyetherimide compositions and methods for the manufacture and use thereof US Patent US9688816 Publication Date 6/27/2017
 
Estrogen receptor
Name:Estrogen receptor
Type:Protein
Mol. Mass.:66230.44
Organism:Homo sapiens (Human)
Description:P03372
Residue:595
BDBM26187
NameBDBM26187
Synonyms:α-CA inhibitor, 11 US9688816, 2 | phenol
TypeSmall organic molecule
Emp. Form.C6H6O
Mol. Mass.94.1112
SMILESOc1ccccc1