Reaction Details
TargetIsoform 2 of MAP kinase-interacting serine/threonine-protein kinase 1 (MNK1a) 344D]
LigandBDBM176777
Substrate/Competitorn/a
Meas. Tech.MKNK1 Kinase High ATP Assay
pH7.5±n/a
IC50 36±n/a nM
Commentsextracted
Citation Klar, UWortmann, LGraham, KPuehler, FSülzle, DKettschau, GLienau, P Substituted thiazolopyrimidines US Patent US9675612 Publication Date 6/13/2017
 
Isoform 2 of MAP kinase-interacting serine/threonine-protein kinase 1 (MNK1a) 344D]
Name:Isoform 2 of MAP kinase-interacting serine/threonine-protein kinase 1 (MNK1a) 344D]
Type:Protein
Mol. Mass.:47416.00
Organism:Homo sapiens (Human)
Description:Q9BUB5-2 with T344D
Residue:424
BDBM176777
NameBDBM176777
Synonyms:US9675612, 20 2-[(Benzyloxy)methyl]-N-(6-methoxy-1H-indazol-5-yl)[1,3]thiazolo[5,4-d]pyrimidin-7-amine
TypeSmall organic molecule
Emp. Form.C21H18N6O2S
Mol. Mass.418.472
SMILESCOc1cc2[nH]ncc2cc1Nc1ncnc2sc(COCc3ccccc3)nc12