Reaction Details
TargetIsoform 2 of MAP kinase-interacting serine/threonine-protein kinase 1 (MNK1a) 344D]
LigandBDBM176814
Substrate/Competitorn/a
Meas. Tech.MKNK1 Kinase High ATP Assay
pH7.5±n/a
IC50 32±n/a nM
Commentsextracted
Citation Klar, UWortmann, LGraham, KPuehler, FSülzle, DKettschau, GLienau, P Substituted thiazolopyrimidines US Patent US9675612 Publication Date 6/13/2017
 
Isoform 2 of MAP kinase-interacting serine/threonine-protein kinase 1 (MNK1a) 344D]
Name:Isoform 2 of MAP kinase-interacting serine/threonine-protein kinase 1 (MNK1a) 344D]
Type:Protein
Mol. Mass.:47416.00
Organism:Homo sapiens (Human)
Description:Q9BUB5-2 with T344D
Residue:424
BDBM176814
NameBDBM176814
Synonyms:US9675612, 47 N-[3-(Dimethylamino)-3-oxopropyl]-7-[(6-isopropoxy-1H-indazol-5-yl)amino]-N-methyl[1,3]thiazolo[5,4-d]pyrimidine-2-carboxamide
TypeSmall organic molecule
Emp. Form.C22H26N8O3S
Mol. Mass.482.559
SMILESCC(C)Oc1cc2[nH]ncc2cc1Nc1ncnc2sc(nc12)C(=O)N(C)CCC(=O)N(C)C