Reaction Details
TargetAcetylcholinesterase
LigandBDBM9405
Substrate/CompetitorBDBM8959
Meas. Tech.Enzyme Inhibition Assay
IC50 170±n/a nM
Citation Sugimoto, HTsuchiya, YSugumi, HHigurashi, KKaribe, NIimura, YSasaki, AKawakami, YNakamura, TAraki, S Novel piperidine derivatives. Synthesis and anti-acetylcholinesterase activity of 1-benzyl-4-[2-(N-benzoylamino)ethyl]piperidine derivatives. J Med Chem33:1880-7 (1990) 
 
Acetylcholinesterase
Name:Acetylcholinesterase
Type:Enzyme
Mol. Mass.:68165.65
Organism:Mus musculus (mouse)
Description:n/a
Residue:614
BDBM9405
BDBM8959
NameBDBM9405
Synonyms:CHEMBL56470 N-[2-(1-benzylpiperidin-4-yl)ethyl]-N-methylbenzamide hydrochloride | Piperidine Derivative 13
TypeSmall organic molecule
Emp. Form.C22H28N2O
Mol. Mass.336.4705
SMILESCN(CCC1CCN(Cc2ccccc2)CC1)C(=O)c1ccccc1