Reaction Details
TargetTyrosine-protein kinase SYK [342-635]
LigandBDBM311126
Substrate/Competitorn/a
Meas. Tech.SYK Kinase Inhibition Test
IC50 0.900±n/a nM
Citation Hoffmann, MDahmann, GGnamm, CFandrick, DRScott, JMcCarthy, C Pyrazolyl-substituted heteroaryls and their use as medicaments US Patent US10155751 Publication Date 12/18/2018
 
Tyrosine-protein kinase SYK [342-635]
Name:Tyrosine-protein kinase SYK [342-635]
Type:Enzyme Catalytic Domain
Mol. Mass.:34105.36
Organism:Homo sapiens (Human)
Description:P43405[342-635]
Residue:294
BDBM311126
NameBDBM311126
Synonyms:US10155751, Example 13
TypeSmall organic molecule
Emp. Form.C22H29N5O2
Mol. Mass.395.498
SMILESC[C@@H](Oc1cc(cc2nn(C)c(C)c12)-c1cnn(c1)C(C)(C)C)[C@H]1CNC(=O)C1