Reaction Details
TargetAP2-associated protein kinase 1
LigandBDBM311157
Substrate/Competitorn/a
Meas. Tech.AAK1 Kinase Assay
IC50 0.500±n/a nM
Citation Luo, GDzierba, CDMacor, JE Biaryl kinase inhibitors US Patent US10155760 Publication Date 12/18/2018
 
AP2-associated protein kinase 1
Name:AP2-associated protein kinase 1
Type:PROTEIN
Mol. Mass.:103884.23
Organism:Homo sapiens (Human)
Description:ChEMBL_774569
Residue:961
BDBM311157
NameBDBM311157
Synonyms:(S)-N-(4-(4-((2-amino-4-methylpentyl)oxy)-3-(trifluoromethyl)phenyl)pyridin-2-yl)acetamide US10351563, Example 5 US10723734, Example 5 US9902722, Example 5
TypeSmall organic molecule
Emp. Form.C20H24F3N3O2
Mol. Mass.395.4187
SMILESCC(C)C[C@H](N)COc1ccc(cc1C(F)(F)F)-c1ccnc(NC(C)=O)c1