Reaction Details
TargetAP2-associated protein kinase 1
LigandBDBM311216
Substrate/Competitorn/a
Meas. Tech.AAK1 Kinase Assay
IC50 0.530±n/a nM
Citation Luo, GDzierba, CDMacor, JE Biaryl kinase inhibitors US Patent US10155760 Publication Date 12/18/2018
 
AP2-associated protein kinase 1
Name:AP2-associated protein kinase 1
Type:PROTEIN
Mol. Mass.:103884.23
Organism:Homo sapiens (Human)
Description:ChEMBL_774569
Residue:961
BDBM311216
NameBDBM311216
Synonyms:(S)-1-(4-(5,7-difluoroquinolin-4-yl)-2-(trifluoromethyl)phenoxy)-2,4-dimethylpentan-2-amine US10351563, Example 72 US10723734, Example 72 US9902722, Example 72
TypeSmall organic molecule
Emp. Form.C23H23F5N2O
Mol. Mass.438.4335
SMILESCC(C)C[C@](C)(N)COc1ccc(cc1C(F)(F)F)-c1ccnc2cc(F)cc(F)c12