Reaction Details
TargetAP2-associated protein kinase 1
LigandBDBM311222
Substrate/Competitorn/a
Meas. Tech.AAK1 Kinase Assay
IC50 0.490±n/a nM
Citation Luo, GDzierba, CDMacor, JE Biaryl kinase inhibitors US Patent US10155760 Publication Date 12/18/2018
 
AP2-associated protein kinase 1
Name:AP2-associated protein kinase 1
Type:PROTEIN
Mol. Mass.:103884.23
Organism:Homo sapiens (Human)
Description:ChEMBL_774569
Residue:961
BDBM311222
NameBDBM311222
Synonyms:(S)-1-((3-chloro-5-(quinolin-4-yl)pyridin-2-yl)oxy)-2,4-dimethylpentan-2-amine US10351563, Example 78 US10723734, Example 78 | US10981910, Example 78
TypeSmall organic molecule
Emp. Form.C21H24ClN3O
Mol. Mass.369.888
SMILESCC(C)C[C@](C)(N)COc1ncc(cc1Cl)-c1ccnc2ccccc12