Reaction Details
TargetAP2-associated protein kinase 1
LigandBDBM311382
Substrate/Competitorn/a
Meas. Tech.AAK1 Kinase Assay
IC50 0.390±n/a nM
Citation Luo, GDzierba, CDMacor, JE Biaryl kinase inhibitors US Patent US10155760 Publication Date 12/18/2018
 
AP2-associated protein kinase 1
Name:AP2-associated protein kinase 1
Type:PROTEIN
Mol. Mass.:103884.23
Organism:Homo sapiens (Human)
Description:ChEMBL_774569
Residue:961
BDBM311382
NameBDBM311382
Synonyms:(S)-1-((4-chloro-6-(6-chloroquinolin-4-yl)pyridin-3-yl)oxy)-2,4-dimethylpentan-2-amine US10351563, Example 239 US10723734, Example 239 US9902722, Example 239
TypeSmall organic molecule
Emp. Form.C21H23Cl2N3O
Mol. Mass.404.333
SMILESCC(C)C[C@](C)(N)COc1cnc(cc1Cl)-c1ccnc2ccc(Cl)cc12