Reaction Details
TargetHistone acetyltransferase KAT2B [719-832]
LigandBDBM311437
Substrate/Competitorn/a
Meas. Tech.PCAF AlphaLisa Binding Assay
IC50 110±n/a nM
Citation Albrecht, BKCote, ACrawford, TDuplessis, MGood, ACLeBlanc, YMagnuson, SNasveschuk, CGPastor, RRomero, AFTaylor, AM Therapeutic compounds and uses thereof US Patent US10155764 Publication Date 12/18/2018
 
Histone acetyltransferase KAT2B [719-832]
Name:Histone acetyltransferase KAT2B [719-832]
Type:Enzyme Catalytic Domain
Mol. Mass.:13623.13
Organism:Homo sapiens (Human)
Description:Q92831[719-832]
Residue:114
BDBM311437
NameBDBM311437
Synonyms:CHEM-US-00134 | US10155764, Example 25
TypeSmall organic molecule
Emp. Form.C19H21ClN4O
Mol. Mass.356.849
SMILESCN(C)C(CNc1nn(C)c(=O)c2ccccc12)c1ccccc1Cl