Reaction Details
TargetHistone acetyltransferase KAT2B [719-832]
LigandBDBM311440
Substrate/Competitorn/a
Meas. Tech.PCAF AlphaLisa Binding Assay
IC50 66.0±n/a nM
Citation Albrecht, BKCote, ACrawford, TDuplessis, MGood, ACLeBlanc, YMagnuson, SNasveschuk, CGPastor, RRomero, AFTaylor, AM Therapeutic compounds and uses thereof US Patent US10155764 Publication Date 12/18/2018
 
Histone acetyltransferase KAT2B [719-832]
Name:Histone acetyltransferase KAT2B [719-832]
Type:Enzyme Catalytic Domain
Mol. Mass.:13623.13
Organism:Homo sapiens (Human)
Description:Q92831[719-832]
Residue:114
BDBM311440
NameBDBM311440
Synonyms:CHEM-US-00137 | US10155764, Example 28
TypeSmall organic molecule
Emp. Form.C14H20N4O
Mol. Mass.260.3348
SMILESCC(CN(C)C)Nc1nn(C)c(=O)c2ccccc12