Reaction Details
TargetHistone acetyltransferase KAT2B [719-832]
LigandBDBM311455
Substrate/Competitorn/a
Meas. Tech.PCAF AlphaLisa Binding Assay
IC50 89.0±n/a nM
Citation Albrecht, BKCote, ACrawford, TDuplessis, MGood, ACLeBlanc, YMagnuson, SNasveschuk, CGPastor, RRomero, AFTaylor, AM Therapeutic compounds and uses thereof US Patent US10155764 Publication Date 12/18/2018
 
Histone acetyltransferase KAT2B [719-832]
Name:Histone acetyltransferase KAT2B [719-832]
Type:Enzyme Catalytic Domain
Mol. Mass.:13623.13
Organism:Homo sapiens (Human)
Description:Q92831[719-832]
Residue:114
BDBM311455
NameBDBM311455
Synonyms:CHEM-US-00152 | US10155764, Example 39B
TypeSmall organic molecule
Emp. Form.C15H22N4O
Mol. Mass.274.3614
SMILESCC[C@H](CNc1nn(C)c(=O)c2ccccc12)N(C)C