Reaction Details
TargetHistone acetyltransferase KAT2B [719-832]
LigandBDBM311483
Substrate/Competitorn/a
Meas. Tech.PCAF AlphaLisa Binding Assay
IC50 25.0±n/a nM
Citation Albrecht, BKCote, ACrawford, TDuplessis, MGood, ACLeBlanc, YMagnuson, SNasveschuk, CGPastor, RRomero, AFTaylor, AM Therapeutic compounds and uses thereof US Patent US10155764 Publication Date 12/18/2018
 
Histone acetyltransferase KAT2B [719-832]
Name:Histone acetyltransferase KAT2B [719-832]
Type:Enzyme Catalytic Domain
Mol. Mass.:13623.13
Organism:Homo sapiens (Human)
Description:Q92831[719-832]
Residue:114
BDBM311483
NameBDBM311483
Synonyms:CHEM-US-00189 | US10155764, Example 63
TypeSmall organic molecule
Emp. Form.C26H28N4O2
Mol. Mass.428.5261
SMILESC[C@H](Nc1nn(C)c(=O)c2ccccc12)[C@@H](N(C)C)c1ccc(Oc2ccccc2)cc1