Reaction Details
TargetHistone acetyltransferase KAT2B [719-832]
LigandBDBM311497
Substrate/Competitorn/a
Meas. Tech.PCAF AlphaLisa Binding Assay
IC50 40.0±n/a nM
Citation Albrecht, BKCote, ACrawford, TDuplessis, MGood, ACLeBlanc, YMagnuson, SNasveschuk, CGPastor, RRomero, AFTaylor, AM Therapeutic compounds and uses thereof US Patent US10155764 Publication Date 12/18/2018
 
Histone acetyltransferase KAT2B [719-832]
Name:Histone acetyltransferase KAT2B [719-832]
Type:Enzyme Catalytic Domain
Mol. Mass.:13623.13
Organism:Homo sapiens (Human)
Description:Q92831[719-832]
Residue:114
BDBM311497
NameBDBM311497
Synonyms:CHEM-US-00209 | US10155764, Example 74
TypeSmall organic molecule
Emp. Form.C25H27N5O3S
Mol. Mass.477.579
SMILESCC(Nc1nn(C)c(=O)c2cccnc12)C(N(C)C)c1ccc(cc1)S(=O)(=O)c1ccccc1