Reaction Details
TargetInterleukin-1 receptor-associated kinase 4
LigandBDBM311516
Substrate/Competitorn/a
Meas. Tech.IRAK4 Kinase Assay
IC50 0.600±n/a nM
Citation Lim, JAltman, MDChilders, MLGibeau, CRHo, GDTsui, H Carboxamide inhibitors of IRAK4 activity US Patent US10155765 Publication Date 12/18/2018
 
Interleukin-1 receptor-associated kinase 4
Name:Interleukin-1 receptor-associated kinase 4
Type:Protein
Mol. Mass.:51519.08
Organism:Homo sapiens (Human)
Description:Q9NWZ3
Residue:460
BDBM311516
NameBDBM311516
Synonyms:5-{[(3R,4R)-3- aminotetrahydro-2H- pyran-4-yl]amino}-N- (3-carbamoyl-1-methyl- 1H-pyrazol-4- yl)pyrazolo[1,5- a]pyrimidine-3- carboxamide trifluoroacetate | US10155765, Example 2
TypeSmall organic molecule
Emp. Form.C17H21N9O3
Mol. Mass.399.4071
SMILESCn1cc(NC(=O)c2cnn3ccc(N[C@@H]4CCOC[C@@H]4N)nc23)c(n1)C(N)=O