Reaction Details
TargetInterleukin-1 receptor-associated kinase 4
LigandBDBM50095470
Substrate/Competitorn/a
Meas. Tech.IRAK4 Kinase Assay
IC50 0.400±n/a nM
Citation Lim, JAltman, MDChilders, MLGibeau, CRHo, GDTsui, H Carboxamide inhibitors of IRAK4 activity US Patent US10155765 Publication Date 12/18/2018
 
Interleukin-1 receptor-associated kinase 4
Name:Interleukin-1 receptor-associated kinase 4
Type:Protein
Mol. Mass.:51519.08
Organism:Homo sapiens (Human)
Description:Q9NWZ3
Residue:460
BDBM50095470
NameBDBM50095470
Synonyms:CHEMBL3590474 | US10155765, Example 9
TypeSmall organic molecule
Emp. Form.C18H23N9O2
Mol. Mass.397.4343
SMILESCn1cc(NC(=O)c2cnn3ccc(N[C@@H]4CCCC[C@@H]4N)nc23)c(n1)C(N)=O