Reaction Details
TargetInterleukin-1 receptor-associated kinase 4
LigandBDBM50095465
Substrate/Competitorn/a
Meas. Tech.IRAK4 Kinase Assay
IC50 2.00±n/a nM
Citation Lim, JAltman, MDChilders, MLGibeau, CRHo, GDTsui, H Carboxamide inhibitors of IRAK4 activity US Patent US10155765 Publication Date 12/18/2018
 
Interleukin-1 receptor-associated kinase 4
Name:Interleukin-1 receptor-associated kinase 4
Type:Protein
Mol. Mass.:51519.08
Organism:Homo sapiens (Human)
Description:Q9NWZ3
Residue:460
BDBM50095465
NameBDBM50095465
Synonyms:CHEMBL3590438 | US10155765, Example 28
TypeSmall organic molecule
Emp. Form.C14H17N9O2
Mol. Mass.343.3439
SMILESCn1cc(NC(=O)c2cnn3ccc(NCCN)nc23)c(n1)C(N)=O