Reaction Details
TargetProto-oncogene tyrosine-protein kinase receptor Ret
LigandBDBM311653
Substrate/Competitorn/a
Meas. Tech.Measurement of Inhibitory Activity Against RET (In Vitro)
IC50 0.200±n/a nM
Citation Miyazaki, IShimamura, TKato, MFujita, HIguchi, S Fused pyrimidine compound or salt thereof US Patent US10155768 Publication Date 12/18/2018
 
Proto-oncogene tyrosine-protein kinase receptor Ret
Name:Proto-oncogene tyrosine-protein kinase receptor Ret
Type:Protein
Mol. Mass.:124318.29
Organism:Homo sapiens (Human)
Description:P07949
Residue:1114
BDBM311653
NameBDBM311653
Synonyms:Ex. Cpd. 105 US11046696, Compound 105
TypeSmall organic molecule
Emp. Form.C27H32N6O2
Mol. Mass.472.582
SMILESCOCc1ccc(NC(=O)c2c(C#CCN3CCCCC3)n(c3ncnc(N)c23)C2(C)CC2)cc1