Reaction Details
TargetProto-oncogene tyrosine-protein kinase receptor Ret
LigandBDBM311723
Substrate/Competitorn/a
Meas. Tech.Measurement of Inhibitory Activity Against RET (In Vitro)
IC50 0.400±n/a nM
Citation Miyazaki, IShimamura, TKato, MFujita, HIguchi, S Fused pyrimidine compound or salt thereof US Patent US10155768 Publication Date 12/18/2018
 
Proto-oncogene tyrosine-protein kinase receptor Ret
Name:Proto-oncogene tyrosine-protein kinase receptor Ret
Type:Protein
Mol. Mass.:124318.29
Organism:Homo sapiens (Human)
Description:P07949
Residue:1114
BDBM311723
NameBDBM311723
Synonyms:Ex. Cpd. 175 US11046696, Compound 175
TypeSmall organic molecule
Emp. Form.C26H23FN6O2
Mol. Mass.470.4982
SMILESCOCc1ccc(NC(=O)c2c(C#Cc3cncc(F)c3)n(c3ncnc(N)c23)C2(C)CC2)cc1