Reaction Details
TargetProto-oncogene tyrosine-protein kinase receptor Ret
LigandBDBM311734
Substrate/Competitorn/a
Meas. Tech.Measurement of Inhibitory Activity Against RET (In Vitro)
IC50 0.200±n/a nM
Citation Miyazaki, IShimamura, TKato, MFujita, HIguchi, S Fused pyrimidine compound or salt thereof US Patent US10155768 Publication Date 12/18/2018
 
Proto-oncogene tyrosine-protein kinase receptor Ret
Name:Proto-oncogene tyrosine-protein kinase receptor Ret
Type:Protein
Mol. Mass.:124318.29
Organism:Homo sapiens (Human)
Description:P07949
Residue:1114
BDBM311734
NameBDBM311734
Synonyms:Ex. Cpd. 186 US11046696, Compound 186
TypeSmall organic molecule
Emp. Form.C26H24N6O2
Mol. Mass.452.5078
SMILESCOCc1ccc(NC(=O)c2c(C#Cc3ccncc3)n(c3ncnc(N)c23)C2(C)CC2)cc1