Reaction Details
TargetProto-oncogene tyrosine-protein kinase receptor Ret
LigandBDBM311736
Substrate/Competitorn/a
Meas. Tech.Measurement of Inhibitory Activity Against RET (In Vitro)
IC50 0.200±n/a nM
Citation Miyazaki, IShimamura, TKato, MFujita, HIguchi, S Fused pyrimidine compound or salt thereof US Patent US10155768 Publication Date 12/18/2018
 
Proto-oncogene tyrosine-protein kinase receptor Ret
Name:Proto-oncogene tyrosine-protein kinase receptor Ret
Type:Protein
Mol. Mass.:124318.29
Organism:Homo sapiens (Human)
Description:P07949
Residue:1114
BDBM311736
NameBDBM311736
Synonyms:Ex. Cpd. 188 US11046696, Compound 188
TypeSmall organic molecule
Emp. Form.C24H27N5O3
Mol. Mass.433.5029
SMILESCOCc1ccc(NC(=O)c2c(C#CCC(C)O)n(c3ncnc(N)c23)C2(C)CC2)cc1